BDBM467025 US10800784, Example 15
SMILES C[C@H]1CN(Cc2cnc(n12)[C@@](C)(O)C(F)(F)F)C(=O)c1cc(nn1C)-c1ccccc1
InChI Key InChIKey=FGTWUFDOPUTMFJ-RNODOKPDSA-N
Data  2 IC50
  Tab Delimited (TSV)   2D SDfile   Computed 3D by Vconf -m prep SDfile
Find this compound or compounds like it in BindingDB:
Activity Spreadsheet -- Enzyme Inhibition Constant Data from BindingDB
Found 1 hit for monomerid = 467025
LigandPNGBDBM467025(US10800784, Example 15)
Affinity DataIC50:  5nM. Assay description: In the case of human PDHK2 (hPDHK2, NCBI Reference Database Accession number NM_002611.4), modified hPDHK2 cDNA wherein FLAG-Tag sequence was added t...
Ligand InfoPC cidPC sid
In DepthDetails US Patent